{"text_format":"1","workbook":"xlsx","n_sheets":9,"sheets":["Steuerung","Erlaeuterungen","Eingabedaten","Parameter","MA-Stammdaten","Muster Abrechnung","Muster Stammdaten","KUA SPV","Pauschalsätze KUA"],"not_rendered":{"charts":0,"images":18,"macros":1,"external_links":0,"defined_names":48,"comments":0,"pivot_tables":0},"unopened":[],"bounds":{"document_bytes":16777216,"sheet_cells":100000,"rows_first":2000,"rows_last":500,"rows_between":2000,"halvings":0,"cell_chars":16384,"cell_head_chars":4096},"cells_cut":0,"cells_raw":0,"read":"whole","date_system":"1900"}

{"sheet":"Steuerung","index":0,"n_rows":30,"n_cols":2,"rows_kept":30,"cut":false,"hidden":false,"merged":[[2,1,2,5],[3,1,3,5]]}
[]
[]
[null,"COVID-19 Kurzarbeitsbeihilfe AMSG"]
[null,"Projekte mit Beginn ab 01.10.2020"]
[]
[]
[]
[]
[]
[]
[]
[]
[]
[]
[]
[]
[]
[]
[]
[]
[]
[]
[]
[]
[]
[]
[]
[]
[]
["Version 6.202 COVID-19"]

{"sheet":"Erlaeuterungen","index":1,"n_rows":5,"n_cols":6,"rows_kept":5,"cut":false,"hidden":false,"merged":[]}
[]
[]
[]
[]
[null,null,null,null,null," "]

{"sheet":"Eingabedaten","index":2,"n_rows":18,"n_cols":7,"rows_kept":18,"cut":false,"hidden":true,"merged":[[15,1,15,4],[16,1,16,4]]}
[]
[3]
["aktuelle Projektdaten:",null,null,null,"Abrechnungsdaten:"]
["Projektnummer",0,null,0]
[null,null,null,null,"Abrechnung von:","2020-10-01",41640]
["Beginn der Kurzarbeitsbeihilfe",null,null,null,"Abrechnung bis:",{"$f":"IF(AND(MONTH(F5)=MONTH(Projektende),YEAR(F5)=YEAR(Projektende)),Projektende,DATE(YEAR(F5),MONTH(F5)+1,0))","v":"2020-10-31"}]
["Ende der Kurzarbeitsbeihilfe",null,"Untergr.:"]
[null,null,{"$f":"IF(Projektbeginn>0,VLOOKUP(YEAR(Projektbeginn),Parameter!B50:C58,2),0)","v":0}]
[null,null,{"$f":"IF(ISBLANK(B14),Stichtag,B14+1)","v":"2020-10-01"}]
[]
["Vorgängerprojekt im Fall einer Verlängerung:"]
["Projektnummer alt",0,null,0]
["Beginn der Kurzarbeitsbeihilfe"]
["Ende der Kurzarbeitsbeihilfe"]
[]
[]
[]
["Stichtag:"]

{"sheet":"Parameter","index":3,"n_rows":82,"n_cols":32,"rows_kept":82,"cut":false,"hidden":true,"merged":[]}
["Passwort:","kuaneu"]
["Blatt prüfen:",true,null,null,"Stichtag","2020-10-01"]
["ftpcmd_file",{"$f":"tmp_path & \"ftpcmd\" & \".tmp\"","v":"c:\\tmp\\ftpcmd.tmp"},null,null,"Höchstbemessung 2020",5370]
["dwh_user","xxx",null,null,"Höchstbemessung 2021",5550]
["dwh_incoming","/dwhdata/incoming"]
["tmp_path","c:\\tmp\\"]
["ftp_bat",{"$f":"tmp_path & \"dwhftp.bat\"","v":"c:\\tmp\\dwhftp.bat"}]
["ftp_log",{"$f":"tmp_path & \"dwhftp.log\"","v":"c:\\tmp\\dwhftp.log"}]
["ftp_logneu",{"$f":"tmp_path & \"dwhftpneu.log\"","v":"c:\\tmp\\dwhftpneu.log"},null,null,"Geringfügigkeitsgrenze 2020",460.66]
["ftp_cmd","c:\\windows\\system32\\ftp.exe -s:",null,null,"Geringfügigkeitsgrenze 2021",475.86]
["dwh_host","xxx"]
["Prüfbericht","xxx"]
["Benutzer","xxx"]
["Protokoll","xxx"]
["Max.Personen",9999]
[]
["Forms_Name:","MSForms"]
["Forms_GUID:","{0D452EE1-E08F-101A-852E-02608C4D0BB4}"]
["Forms_Major:",2]
["Forms_Minor:",0]
[]
[]
[]
[]
["Normalarbeitszeit:",35,10]
[null,35.5,9]
[null,36,8]
[null,36.5,7]
[null,37,6]
[null,37.5,5]
[null,38,4]
[null,38.5,3]
[null,39,2]
[null,39.5,1]
[null,40,0]
[null,45,-1]
[null,48,-2]
[null,55,-3]
[null,60,-4]
[]
["Geschlecht:","M"]
[null,"W"]
[]
[]
["DGSV_berechtigt:","Ja - siehe Erläuterung 1"]
[null,"Ja - siehe Erläuterung 2"]
[null,"Nein"]
[]
[]
[]
["DGSV_Sätze:",2013,5180]
[null,2014,5285]
[null,2015,5425]
[null,2016,5670]
[null,2017,5810]
[null,2018,5985]
[null,2019,6090]
[null,2020,6265]
[null,2021,6265]
[null,2022]
[]
[]
[]
[]
[]
[]
[]
[]
[]
[]
[]
[]
[]
[]
[]
[]
[]
[]
[]
[]
[]
[null,null,null,null,null,null,null,null,null,null,null,null,null,null,null,null,null,null,null,null,null,null,null,null,null,null,null,null,null,null,null,"4711_AmS!"]

{"sheet":"MA-Stammdaten","index":4,"n_rows":2,"n_cols":21,"rows_kept":2,"cut":false,"hidden":false,"merged":[]}
[1,2,3,4,5,6,7,8,9,10,11,12,13,14,15,16,17,18,19,20,21]
["SV-Nummer","Familienname","Titel","Vorname","Geschl","Bruttoentgelt vor COVID-19 Kurzarbeit \nin Euro pro Monat","Lehrling","Normalarbeitszeit vor COVID-19 Kurzarbeit\nin Stunden pro Woche","Pauschalsatz COVID-19 Kurzarbeit\nin Euro pro Stunde","Mindestbrutto-entgelt bei COVID-19 Kurzarbeit\nin Euro pro Monat","Bruttoentgelt für den ganzen Monat","Normalarbeitszeitstunden","Feiertage","Stunden für die Ersatzleistungen gebühren","geleistete Arbeitsstunden","konsumierter Urlaub/konsumiertes Zeitguthaben","Entgeltfortzahlung für Krankenstand und § 1155 Abs. 3 ABGB in der geplanten Arbeitszeit","geleistete Überstunden","davon Aus- und Weiterbildung","Abrechnungszeitraum von","Abrechnungszeitraum bis"]

{"sheet":"Muster Abrechnung","index":5,"n_rows":3,"n_cols":30,"rows_kept":3,"cut":false,"hidden":true,"merged":[]}
["2010-01-01",{"$f":"DAY(DATE(YEAR(A1),MONTH(A1)+1,0))","v":31},null,null,null,null,null,null,null,null,null,null,null,null,null,null,null,null,null,null,null,null,null,null,null,null,null,{"$f":"IF(YEAR($A$1)=2021,HBMG_2021,HBMG_2020)","v":5370},{"$f":"IF(YEAR(Projektbeginn)=2021,GFKG_2021,GFKG_2020)","v":460.66}]
["SV-Nummer","Familienname","Titel","Vorname","Geschl","Bruttoentgelt vor COVID-19 Kurzarbeit \nin Euro pro Monat","Lehrling","Normalarbeitszeit vor COVID-19 Kurzarbeit\nin Stunden pro Woche","Mindestbrutto-entgelt bei COVID-19 Kurzarbeit\nin Euro pro Monat","Bruttoentgelt für den ganzen Monat\nin Euro pro Monat","Normalarbeits-zeitstunden laut Kollektivvertrag/\nArbeitsvertrag \nin Stunden im Abrechnungs-zeitraum","Feiertage\nin Stunden im Abrechnungs-zeitraum","Stunden, für die Ersatzleistungen gebühren\nin Stunden im Abrechnungs-zeitraum","errechnete potentiell zu leistende Arbeitsstunden\nin Stunden im Abrechnungs-zeitraum","geleistete Arbeitsstunden\nin Stunden im Abrechnungs-zeitraum","konsumierter Urlaub/ konsumiertes Zeitguthaben/\nsonstige Dienstver-hinderungen \nin Stunden im Abrechnungs-zeitraum","Entgeltfortzahlung für Krankenstand und § 1155 Abs. 3 ABGB in der geplanten Arbeitszeit\nin Stunden im Abrechnungs-zeitraum","errechnete Ausfallstunden\nin Stunden im Abrechnungs-zeitraum","davon \nAus- und Weiterbildung\nin Stunden im Abrechnungs-zeitraum","geleistete Überstunden\nin Stunden im Abrechnungs-zeitraum","verrechnete Ausfallstunden\nin Stunden im Abrechnungs-zeitraum","verrechnete COVID-19 Kurzarbeits-beihilfe\nin Euro für den Abrechnungs-zeitraum","Abrechnungs-\nzeitraum\nvon","Abrechnungs-\nzeitraum\nbis","Anmerkung 1","Anmerkung 2",null,"NAZ im Abrechungszeitraum","Entgelt für Arbeit","Unterstützung"]
[null,null,null,null,null,null,null,null,{"$f":"IF(OR(ROUND(F3,2)<350,AND(ROUND(F3,2)<=$AC$1,G3=\"N\")),0,INDEX('KUA SPV'!$E$1:$E$3000,MATCH(MAX(355,MIN($AB$1,ROUND(F3,2)))-0.01,'KUA SPV'!$B$1:$B$3000,1),1))","v":0},null,null,null,null,{"$f":"IF(ISNUMBER($K3),ROUND(ROUND($K3,2)-ROUND($L3,2)-ROUND($M3,2),2),0)","v":0},null,null,null,{"$f":"IF(ISNUMBER($N3),ROUND(ROUND($N3,2)-ROUND($O3,2)-ROUND($P3,2)-ROUND($Q3,2),2),0)","v":0},null,null,{"$f":"IF(ISNUMBER($R3),MAX(ROUND(ROUND($R3,2)-ROUND($T3,2),2),0),0)","v":0},{"$f":"ROUND(AD3*(1.27)+IF(I3=0,0,MIN($AB$1,MAX(0,(MIN(F3,$AB$1)/AB3*K3)-AC3))/6*1.3)+IF(I3=0,0,MAX(0,MIN($AB$1-INDEX('KUA SPV'!$E$1:$E$3000,MATCH($AB$1-0.01,'KUA SPV'!$B$1:$B$3000,1),1),MIN($AB$1,F3)*(K3/AB3)-(AC3+AD3))*0.39)),2)","v":{"$error":"#DIV/0!"}},null,null,null,null,null,{"$f":"ROUND(NETWORKDAYS(EOMONTH($A$1,-1)+1,EOMONTH($A$1,0))*(H3/5),2)","v":0},{"$f":"ROUND(F3/AB3*(K3-U3),2)","v":{"$error":"#DIV/0!"}},{"$f":"MAX(0,ROUND(I3*(K3/AB3)-AC3,2))","v":{"$error":"#DIV/0!"}}]

{"sheet":"Muster Stammdaten","index":6,"n_rows":3,"n_cols":21,"rows_kept":3,"cut":false,"hidden":true,"merged":[]}
[1,2,3,4,5,6,7,8,9,10,11,12,13,14,15,16,17,18,19,20,21]
["SV-Nummer","Familienname","Titel","Vorname","Geschl","Bruttoentgelt vor COVID-19 Kurzarbeit \nin Euro pro Monat","Lehrling","Normalarbeitszeit vor COVID-19 Kurzarbeit\nin Stunden pro Woche","Pauschalsatz COVID-19 Kurzarbeit\nin Euro pro Stunde","Mindestbrutto-entgelt bei COVID-19 Kurzarbeit\nin Euro pro Monat","Bruttoentgelt für den ganzen Monat","Normalarbeitszeitstunden","Feiertage","Stunden für die Ersatzleistungen gebühren","geleistete Arbeitsstunden","konsumierter Urlaub/konsumiertes Zeitguthaben","Entgeltfortzahlung für Krankenstand und § 1155 Abs. 3 ABGB in der geplanten Arbeitszeit","geleistete Überstunden","davon Aus- und Weiterbildung","Abrechnungszeitraum von","Abrechnungszeitraum bis"]
[null,null,null,null,null,460.67,"N",38.5,{"$f":"0","v":0},{"$f":"IF(OR(ROUND(F3,2)<350,AND(ROUND(F3,2)<=GFKG_2020,G3=\"N\")),0,INDEX('KUA SPV'!$E$1:$E$3000,MATCH(MAX(355,MIN(HBMG_2020,ROUND(F3,2)))-0.01,'KUA SPV'!$B$1:$B$3000,1),1))","v":353.57}]

{"sheet":"KUA SPV","index":7,"n_rows":2081,"n_cols":5,"rows_kept":2081,"cut":false,"hidden":true,"merged":[]}
[null,"BMAFJ Kurzarbeits-Mindestbruttoentgelt-Tabelle "]
[null,"Bruttoentgelt vor Kurzarbeit"]
[null,"von über","bis einschließlich","Nettoersatzrate","Mindest-Bruttoentgelt während KUA"]
[null,350,355,90,317.25]
[null,355,360,90,321.75]
[null,360,365,90,326.25]
[null,365,370,90,330.75]
[null,370,375,90,335.25]
[null,375,380,90,339.75]
[null,380,385,90,344.25]
[null,385,390,90,348.75]
[null,390,395,90,353.25]
[null,395,400,90,357.75]
[null,400,405,90,362.25]
[null,405,410,90,366.75]
[null,410,415,90,371.25]
[null,415,420,90,375.75]
[null,420,425,90,380.25]
[null,425,430,90,384.75]
[null,430,435,90,389.25]
[null,435,440,90,393.75]
[null,440,445,90,398.25]
[null,445,450,90,402.75]
[null,450,455,90,407.25]
[null,455,460.66,90,412.05]
[null,460.66,465,90,353.57]
[null,465,470,90,357.14]
[null,470,475,90,360.96]
[null,475,480,90,364.77]
[null,480,485,90,368.59]
[null,485,490,90,372.41]
[null,490,495,90,376.23]
[null,495,500,90,380.05]
[null,500,505,90,383.87]
[null,505,510,90,387.69]
[null,510,515,90,391.51]
[null,515,520,90,395.33]
[null,520,525,90,399.15]
[null,525,530,90,402.97]
[null,530,535,90,406.79]
[null,535,540,90,410.61]
[null,540,545,90,414.43]
[null,545,550,90,418.25]
[null,550,555,90,422.07]
[null,555,560,90,425.89]
[null,560,565,90,429.71]
[null,565,570,90,433.53]
[null,570,575,90,437.35]
[null,575,580,90,441.16]
[null,580,585,90,444.99]
[null,585,590,90,448.81]
[null,590,595,90,452.63]
[null,595,600,90,456.45]
[null,600,605,90,501.43]
[null,605,610,90,546.75]
[null,610,615,90,551.25]
[null,615,620,90,555.75]
[null,620,625,90,560.25]
[null,625,630,90,564.75]
[null,630,635,90,569.25]
[null,635,640,90,573.75]
[null,640,645,90,578.25]
[null,645,650,90,582.75]
[null,650,655,90,587.25]
[null,655,660,90,591.75]
[null,660,665,90,596.25]
[null,665,670,90,600.75]
[null,670,675,90,605.25]
[null,675,680,90,609.75]
[null,680,685,90,614.25]
[null,685,690,90,618.75]
[null,690,695,90,623.25]
[null,695,700,90,627.75]
[null,700,705,90,632.24]
[null,705,710,90,636.75]
[null,710,715,90,641.26]
[null,715,720,90,645.76]
[null,720,725,90,650.26]
[null,725,730,90,654.75]
[null,730,735,90,659.25]
[null,735,740,90,663.75]
[null,740,745,90,668.25]
[null,745,750,90,672.75]
[null,750,755,90,677.25]
[null,755,760,90,681.75]
[null,760,765,90,686.25]
[null,765,770,90,690.75]
[null,770,775,90,695.25]
[null,775,780,90,699.75]
[null,780,785,90,704.25]
[null,785,790,90,708.75]
[null,790,795,90,713.26]
[null,795,800,90,717.76]
[null,800,805,90,722.25]
[null,805,810,90,726.75]
[null,810,815,90,731.25]
[null,815,820,90,735.76]
[null,820,825,90,740.26]
[null,825,830,90,744.75]
[null,830,835,90,749.25]
[null,835,840,90,753.76]
[null,840,845,90,758.26]
[null,845,850,90,762.76]
[null,850,855,90,767.25]
[null,855,860,90,771.75]
[null,860,865,90,776.25]
[null,865,870,90,780.75]
[null,870,875,90,785.25]
[null,875,880,90,789.75]
[null,880,885,90,794.25]
[null,885,890,90,798.75]
[null,890,895,90,803.25]
[null,895,900,90,807.75]
[null,900,905,90,812.25]
[null,905,910,90,816.75]
[null,910,915,90,821.25]
[null,915,920,90,825.75]
[null,920,925,90,830.25]
[null,925,930,90,834.75]
[null,930,935,90,839.25]
[null,935,940,90,843.75]
[null,940,945,90,848.25]
[null,945,950,90,852.75]
[null,950,955,90,857.24]
[null,955,960,90,861.75]
[null,960,965,90,866.26]
[null,965,970,90,870.76]
[null,970,975,90,875.26]
[null,975,980,90,879.75]
[null,980,985,90,884.25]
[null,985,990,90,888.75]
[null,990,995,90,893.25]
[null,995,1000,90,897.75]
[null,1000,1005,90,902.25]
[null,1005,1010,90,906.75]
[null,1010,1015,90,911.25]
[null,1015,1020,90,915.75]
[null,1020,1025,90,920.25]
[null,1025,1030,90,924.75]
[null,1030,1035,90,929.25]
[null,1035,1040,90,933.75]
[null,1040,1045,90,938.25]
[null,1045,1050,90,942.75]
[null,1050,1055,90,947.25]
[null,1055,1060,90,951.75]
[null,1060,1065,90,956.25]
[null,1065,1070,90,960.75]
[null,1070,1075,90,965.25]
[null,1075,1080,90,969.74]
[null,1080,1085,90,974.25]
[null,1085,1090,90,978.76]
[null,1090,1095,90,983.26]
[null,1095,1100,90,987.76]
[null,1100,1105,90,992.25]
[null,1105,1110,90,996.75]
[null,1110,1115,90,1001.25]
[null,1115,1120,90,1005.75]
[null,1120,1125,90,1010.25]
[null,1125,1130,90,1014.75]
[null,1130,1135,90,1019.25]
[null,1135,1140,90,1023.75]
[null,1140,1145,90,1028.25]
[null,1145,1150,90,1032.75]
[null,1150,1155,90,1037.25]
[null,1155,1160,90,1041.75]
[null,1160,1165,90,1046.25]
[null,1165,1170,90,1050.75]
[null,1170,1175,90,1055.25]
[null,1175,1180,90,1059.75]
[null,1180,1185,90,1064.25]
[null,1185,1190,90,1068.75]
[null,1190,1195,90,1073.25]
[null,1195,1200,90,1077.75]
[null,1200,1205,90,1082.24]
[null,1205,1210,90,1086.75]
[null,1210,1215,90,1091.26]
[null,1215,1220,90,1095.76]
[null,1220,1225,90,1100.26]
[null,1225,1230,90,1104.75]
[null,1230,1235,90,1109.25]
[null,1235,1240,90,1113.75]
[null,1240,1245,90,1118.25]
[null,1245,1250,90,1122.75]
[null,1250,1255,90,1127.25]
[null,1255,1260,90,1131.29]
[null,1260,1265,90,1134.77]
[null,1265,1270,90,1138.1400000000001]
[null,1270,1275,90,1141.51]
[null,1275,1280,90,1144.8800000000001]
[null,1280,1285,90,1148.26]
[null,1285,1290,90,1151.6400000000001]
[null,1290,1295,90,1155.01]
[null,1295,1300,90,1158.3900000000001]
[null,1300,1305,90,1161.76]
[null,1305,1310,90,1165.1400000000001]
[null,1310,1315,90,1168.52]
[null,1315,1320,90,1171.9000000000001]
[null,1320,1325,90,1175.27]
[null,1325,1330,90,1178.6400000000001]
[null,1330,1335,90,1182.01]
[null,1335,1340,90,1185.3800000000001]
[null,1340,1345,90,1188.77]
[null,1345,1350,90,1192.1500000000001]
[null,1350,1355,90,1195.52]
[null,1355,1360,90,1198.8900000000001]
[null,1360,1365,90,1202.27]
[null,1365,1370,90,1205.6500000000001]
[null,1370,1375,90,1209.02]
[null,1375,1380,90,1212.3900000000001]
[null,1380,1385,90,1215.76]
[null,1385,1390,90,1219.1400000000001]
[null,1390,1395,90,1222.51]
[null,1395,1400,90,1225.8900000000001]
[null,1400,1405,90,1229.27]
[null,1405,1410,90,1232.6400000000001]
[null,1410,1415,90,1236.02]
[null,1415,1420,90,1239.3900000000001]
[null,1420,1425,90,1242.76]
[null,1425,1430,90,1246.1400000000001]
[null,1430,1435,90,1249.52]
[null,1435,1440,90,1252.8900000000001]
[null,1440,1445,90,1256.6099999999999]
[null,1445,1450,90,1260.8900000000001]
[null,1450,1455,90,1265.3900000000001]
[null,1455,1460,90,1269.9000000000001]
[null,1460,1465,90,1274.4000000000001]
[null,1465,1470,90,1278.8900000000001]
[null,1470,1475,90,1283.3900000000001]
[null,1475,1480,90,1287.8800000000001]
[null,1480,1485,90,1292.3800000000001]
[null,1485,1490,90,1296.8900000000001]
[null,1490,1495,90,1301.3900000000001]
[null,1495,1500,90,1305.8900000000001]
[null,1500,1505,90,1310.3900000000001]
[null,1505,1510,90,1314.89]
[null,1510,1515,90,1319.39]
[null,1515,1520,90,1323.9]
[null,1520,1525,90,1328.4]
[null,1525,1530,90,1332.89]
[null,1530,1535,90,1337.39]
[null,1535,1540,90,1341.88]
[null,1540,1545,90,1346.39]
[null,1545,1550,90,1350.9]
[null,1550,1555,90,1355.4]
[null,1555,1560,90,1359.9]
[null,1560,1565,90,1364.4]
[null,1565,1570,90,1368.88]
[null,1570,1575,90,1373.39]
[null,1575,1580,90,1377.89]
[null,1580,1585,90,1382.39]
[null,1585,1590,90,1386.89]
[null,1590,1595,90,1391.39]
[null,1595,1600,90,1395.89]
[null,1600,1605,90,1400.39]
[null,1605,1610,90,1404.9]
[null,1610,1615,90,1409.4]
[null,1615,1620,90,1413.89]
[null,1620,1625,90,1418.38]
[null,1625,1630,90,1422.88]
[null,1630,1635,90,1427.39]
[null,1635,1640,90,1431.89]
[null,1640,1645,90,1436.39]
[null,1645,1650,90,1440.89]
[null,1650,1655,90,1445.38]
[null,1655,1660,90,1449.88]
[null,1660,1665,90,1454.39]
[null,1665,1670,90,1458.89]
[null,1670,1675,90,1463.38]
[null,1675,1680,90,1467.88]
[null,1680,1685,90,1472.38]
[null,1685,1690,90,1476.88]
[null,1690,1695,90,1481.39]
[null,1695,1700,90,1485.9]
[null,1700,1705,85,1384.34]
[null,1705,1710,85,1388.59]
[null,1710,1715,85,1392.84]
[null,1715,1720,85,1397.09]
[null,1720,1725,85,1401.33]
[null,1725,1730,85,1405.59]
[null,1730,1735,85,1401.15]
[null,1735,1740,85,1396.68]
[null,1740,1745,85,1400.88]
[null,1745,1750,85,1405.09]
[null,1750,1755,85,1409.29]
[null,1755,1760,85,1413.48]
[null,1760,1765,85,1417.69]
[null,1765,1770,85,1421.89]
[null,1770,1775,85,1426.09]
[null,1775,1780,85,1430.28]
[null,1780,1785,85,1434.47]
[null,1785,1790,85,1438.67]
[null,1790,1795,85,1442.88]
[null,1795,1800,85,1447.09]
[null,1800,1805,85,1451.29]
[null,1805,1810,85,1455.34]
[null,1810,1815,85,1459.11]
[null,1815,1820,85,1462.74]
[null,1820,1825,85,1466.38]
[null,1825,1830,85,1470.02]
[null,1830,1835,85,1473.66]
[null,1835,1840,85,1477.3]
[null,1840,1845,85,1480.94]
[null,1845,1850,85,1484.59]
[null,1850,1855,85,1488.23]
[null,1855,1860,85,1491.86]
[null,1860,1865,85,1495.5]
[null,1865,1870,85,1499.13]
[null,1870,1875,85,1502.78]
[null,1875,1880,85,1506.42]
[null,1880,1885,85,1510.05]
[null,1885,1890,85,1513.7]
[null,1890,1895,85,1509.12]
[null,1895,1900,85,1504.52]
[null,1900,1905,85,1508.11]
[null,1905,1910,85,1511.71]
[null,1910,1915,85,1515.31]
[null,1915,1920,85,1518.9]
[null,1920,1925,85,1522.5]
[null,1925,1930,85,1526.1]
[null,1930,1935,85,1529.69]
[null,1935,1940,85,1533.29]
[null,1940,1945,85,1536.89]
[null,1945,1950,85,1540.48]
[null,1950,1955,85,1544.08]
[null,1955,1960,85,1547.68]
[null,1960,1965,85,1551.27]
[null,1965,1970,85,1554.86]
[null,1970,1975,85,1558.46]
[null,1975,1980,85,1562.06]
[null,1980,1985,85,1565.65]
[null,1985,1990,85,1569.25]
[null,1990,1995,85,1572.85]
[null,1995,2000,85,1576.45]
[null,2000,2005,85,1580.04]
[null,2005,2010,85,1583.64]
[null,2010,2015,85,1587.24]
[null,2015,2020,85,1590.84]
[null,2020,2025,85,1594.44]
[null,2025,2030,85,1598.03]
[null,2030,2035,85,1601.63]
[null,2035,2040,85,1605.23]
[null,2040,2045,85,1608.81]
[null,2045,2050,85,1603.51]
[null,2050,2055,85,1598.2]
[null,2055,2060,85,1601.75]
[null,2060,2065,85,1605.3]
[null,2065,2070,85,1608.86]
[null,2070,2075,85,1612.41]
[null,2075,2080,85,1615.95]
[null,2080,2085,85,1619.51]
[null,2085,2090,85,1623.06]
[null,2090,2095,85,1626.62]
[null,2095,2100,85,1630.18]
[null,2100,2105,85,1633.73]
[null,2105,2110,85,1637.29]
[null,2110,2115,85,1640.84]
[null,2115,2120,85,1644.39]
[null,2120,2125,85,1647.95]
[null,2125,2130,85,1651.49]
[null,2130,2135,85,1655.04]
[null,2135,2140,85,1658.6]
[null,2140,2145,85,1662.14]
[null,2145,2150,85,1665.69]
[null,2150,2155,85,1669.25]
[null,2155,2160,85,1672.82]
[null,2160,2165,85,1676.38]
[null,2165,2170,85,1679.93]
[null,2170,2175,85,1683.48]
[null,2175,2180,85,1687.03]
[null,2180,2185,85,1690.58]
[null,2185,2190,85,1694.13]
[null,2190,2195,85,1697.69]
[null,2195,2200,85,1701.24]
[null,2200,2205,85,1704.78]
[null,2205,2210,85,1708.34]
[null,2210,2215,85,1711.9]
[null,2215,2220,85,1715.46]
[null,2220,2225,85,1719.01]
[null,2225,2230,85,1722.56]
[null,2230,2235,85,1726.11]
[null,2235,2240,85,1729.66]
[null,2240,2245,85,1743.56]
[null,2245,2250,85,1757.48]
[null,2250,2255,85,1761.06]
[null,2255,2260,85,1764.66]
[null,2260,2265,85,1768.26]
[null,2265,2270,85,1771.85]
[null,2270,2275,85,1775.45]
[null,2275,2280,85,1779.05]
[null,2280,2285,85,1782.64]
[null,2285,2290,85,1786.24]
[null,2290,2295,85,1789.84]
[null,2295,2300,85,1793.44]
[null,2300,2305,85,1797.02]
[null,2305,2310,85,1800.62]
[null,2310,2315,85,1804.22]
[null,2315,2320,85,1807.98]
[null,2320,2325,85,1812.02]
[null,2325,2330,85,1816.17]
[null,2330,2335,85,1820.32]
{"$rows_left_out":1682}
{"sheet":"Pauschalsätze KUA","index":8,"n_rows":106,"n_cols":6,"rows_kept":106,"cut":false,"hidden":true,"merged":[[0,3,2,3],[103,1,103,2],[0,0,2,0],[0,1,1,2],[0,5,2,5],[0,4,2,4]]}
["Lohn-gruppe","Monatsverdienst in  € \ninkl. Sonderzahlung",null,"Arbeits-kosten Neu","Mindest-Bruttoentgelt während KUA","Pauschal-satz bei 40 Stunden"]
[]
[null,"von","bis"]
[1,0,460.99,553.29999999999995,352.17,3.73]
[2,461,500.99,553.29999999999995,352.17,3.73]
[3,501,550.99,601.31000000000006,382.73,4.05]
[4,551,600.99,661.32,420.92,4.45]
[5,601,650.99,721.33,459.12,4.8600000000000003]
[6,651,700.99,781.33999999999992,585.9,5.26]
[7,701,750.99,841.35,630.9,5.67]
[8,751,800.99,901.36999999999989,675.91,6.07]
[9,801,850.99,961.36999999999989,720.9,6.48]
[10,851,900.99,1021.3900000000001,765.9,6.88]
[11,901,950.99,1081.3900000000001,810.9,7.28]
[12,951,1000.99,1141.4099999999999,855.9,7.69]
[13,1001,1050.99,1201.4199999999998,900.91,8.09]
[14,1051,1100.99,1261.4299999999998,945.9,8.5]
[15,1101,1150.99,1321.4399999999998,990.9,8.9]
[16,1151,1200.99,1381.4499999999998,1035.9000000000001,9.31]
[17,1201,1250.99,1441.4599999999998,1080.9000000000001,9.7100000000000009]
[18,1251,1300.99,1501.4800000000002,1125.9100000000001,10.11]
[19,1301,1350.99,1552.8700000000001,1160.76,10.46]
[20,1351,1400.99,1603.3400000000001,1194.51,10.8]
[21,1401,1450.99,1653.79,1228.25,11.14]
[22,1451,1500.99,1705.9899999999998,1264.04,11.49]
[23,1501,1550.99,1766,1309.05,11.9]
[24,1551,1600.99,1826.01,1354.04,12.3]
[25,1601,1650.99,1886.02,1399.05,12.7]
[26,1651,1700.99,1946.0399999999997,1444.05,13.11]
[27,1701,1750.99,1916.0900000000001,1383.07,12.91]
[28,1751,1800.99,1976.6,1408.02,13.31]
[29,1801,1850.99,2034.55,1450.01,13.7]
[30,1851,1900.99,2088.3800000000006,1487.13,14.07]
[31,1901,1950.99,2146.5899999999997,1507.03,14.46]
[32,1951,2000.99,2199.9299999999998,1542.99,14.82]
[33,2001,2050.9899999999998,2253.2799999999997,1578.97,15.18]
[34,2051,2100.9899999999998,2312.02,1597.12,15.57]
[35,2101,2150.9899999999998,2365.5,1632.67,15.93]
[36,2151,2200.9899999999998,2418.9699999999998,1668.19,16.29]
[37,2201,2250.9899999999998,2472.44,1703.72,16.649999999999999]
[38,2251,2300.9899999999998,2525.92,1759.99,17.010000000000002]
[39,2301,2350.9899999999998,2579.3899999999994,1795.95,17.37]
[40,2351,2400.9899999999998,2636.0400000000004,1835.68,17.760000000000002]
[41,2401,2450.9899999999998,2694.15,1877.17,18.149999999999999]
[42,2451,2500.9899999999998,2752.2500000000005,1941.78,18.54]
[43,2501,2550.9899999999998,2810.3599999999997,1983.77,18.93]
[44,2551,2600.9899999999998,2868.48,2025.76,19.32]
[45,2601,2650.99,2926.59,2093,19.71]
[46,2651,2700.99,2984.7300000000005,2135.5300000000002,20.100000000000001]
[47,2701,2750.99,2900.0800000000004,1979.5,19.53]
[48,2751,2800.99,2956.1600000000003,2019.03,19.91]
[49,2801,2850.99,3012.22,2083.6799999999998,20.29]
[50,2851,2900.99,3068.3,2123.69,20.67]
[51,2901,2950.99,3124.36,2163.69,21.05]
[52,2951,3000.99,3180.4199999999996,2203.6799999999998,21.42]
[53,3001,3050.99,3236.4799999999996,2243.67,21.8]
[54,3051,3100.99,3292.56,2283.6799999999998,22.18]
[55,3101,3150.99,3348.64,2323.6999999999998,22.56]
[56,3151,3200.99,3404.6899999999996,2363.6799999999998,22.93]
[57,3201,3250.99,3458.9,2401.42,23.3]
[58,3251,3300.99,3511.4500000000003,2437.11,23.65]
[59,3301,3350.99,3563.97,2472.79,24.01]
[60,3351,3400.99,3616.5199999999995,2508.4899999999998,24.36]
[61,3401,3450.99,3669.05,2544.17,24.71]
[62,3451,3500.99,3721.5999999999995,2579.87,25.07]
[63,3501,3550.99,3774.1200000000003,2615.5500000000002,25.42]
[64,3551,3600.99,3826.6800000000003,2651.26,25.78]
[65,3601,3650.99,3879.2,2686.93,26.13]
[66,3651,3700.99,3931.75,2722.63,26.48]
[67,3701,3750.99,3984.2900000000004,2758.33,26.84]
[68,3751,3800.99,4036.84,2794.03,27.19]
[69,3801,3850.99,4089.37,2829.71,27.55]
[70,3851,3900.99,4141.92,2865.41,27.9]
[71,3901,3950.99,4194.4400000000005,2901.09,28.25]
[72,3951,4000.99,4247.0000000000009,2936.8,28.61]
[73,4001,4050.99,4299.5200000000004,2972.47,28.96]
[74,4051,4100.99,4352.07,3008.17,29.32]
[75,4101,4150.99,4404.6099999999997,3043.87,29.67]
[76,4151,4200.99,4457.1499999999996,3079.55,30.02]
[77,4201,4250.99,4509.6900000000005,3115.25,30.38]
[78,4251,4300.99,4562.24,3150.95,30.73]
[79,4301,4350.99,4615.9699999999993,3188.1,31.09]
[80,4351,4400.99,4672.04,3228.1,31.47]
[81,4401,4450.99,4728.0999999999995,3268.1,31.85]
[82,4451,4500.99,4784.17,3308.1,32.229999999999997]
[83,4501,4550.99,4840.2299999999996,3348.09,32.6]
[84,4551,4600.99,4896.3,3388.09,32.979999999999997]
[85,4601,4650.99,4952.3599999999997,3428.09,33.36]
[86,4651,4700.99,5008.43,3468.09,33.74]
[87,4701,4750.99,5064.49,3508.08,34.11]
[88,4751,4800.99,5120.5700000000006,3548.09,34.49]
[89,4801,4850.99,5176.6400000000003,3588.1,34.869999999999997]
[90,4851,4900.99,5232.7000000000007,3628.09,35.25]
[91,4901,4950.99,5288.77,3668.1,35.619999999999997]
[92,4951,5000.99,5344.83,3708.08,36]
[93,5001,5050.99,5400.9000000000005,3748.09,36.380000000000003]
[94,5051,5100.99,5456.96,3788.08,36.76]
[95,5101,5150.99,5513.0300000000007,3828.09,37.14]
[96,5151,5200.99,5569.09,3868.07,37.51]
[97,5201,5250.99,5625.16,3908.08,37.89]
[98,5251,5300.99,5681.2399999999989,3948.09,38.270000000000003]
[99,5301,5350.99,5737.3099999999986,3988.1,38.65]
[100,5351,5369.99,5793.3899999999994,4028.11,39.020000000000003]
[101,5370,null,5814.6799999999994,4043.29,39.17]
[]
[null,1,2]